Target
Tyrosine-protein kinase Lck
Ligand
BDBM50120123
Substrate
Meas. Tech.
ChEBML_96910
IC50
8±n/a nM
Citation
 Chen, PIwanowicz, EJNorris, DGu, HHLin, JMoquin, RVDas, JWityak, JSpergel, SHde Fex, HPang, SPitt, SShen, DRSchieven, GLBarrish, JC Synthesis and SAR of novel imidazoquinoxaline-based Lck inhibitors: improvement of cell potency. Bioorg Med Chem Lett 12:3153-6 (2002)  
Target
Name:
Tyrosine-protein kinase Lck
Synonyms:
2.7.10.2 LCK_HUMAN Leukocyte C-terminal Src kinase Lymphocyte-specific protein tyrosine kinase Protein YT16 Proto-oncogene tyrosine-protein kinase LCK T cell-specific protein-tyrosine kinase
Type:
Mol. Mass.:
57987.83
Organism:
Homo sapiens (Human)
Description:
P06239
Residue:
509
  
Inhibitor
Name:
BDBM50120123
Synonyms:
(2-Chloro-6-methyl-phenyl)-[7-(4-methyl-piperazin-1-yl)-imidazo[1,5-a]quinoxalin-4-yl]-amine N-(2-chloro-6-methylphenyl)-7-(4-methylpiperazin-1-yl)imidazo[1,5-a]quinoxalin-4-amine
Type:
Small organic molecule
Emp. Form.:
C22H23ClN6
Mol. Mass.:
406.911
SMILES:
CN1CCN(CC1)c1ccc2c(c1)nc(Nc1c(C)cccc1Cl)c1cncn21
: