Target
Fibroblast growth factor 2
Ligand
BDBM50000130
Substrate
Meas. Tech.
ChEMBL_70467 (CHEMBL676958)
IC50
25.2±n/a nM
Citation
 Murphy, PVPitt, NO'Brien, AEnright, PMDunne, AWilson, SJDuane, RMO'Boyle, KM Identification of novel inhibitors of fibroblast growth factor (FGF-2) binding to heparin and endothelial cell survival from a structurally diverse carbohybrid library. Bioorg Med Chem Lett 12:3287-90 (2002)  
Target
Name:
Fibroblast growth factor 2
Synonyms:
Basic fibroblast growth factor FGF2 FGFB Fibroblast growth factor receptor 2 (FGF-2) Heparin-binding growth factor 2
Type:
Protein
Mol. Mass.:
30803.89
Organism:
Homo sapiens (Human)
Description:
P09038
Residue:
288
  
Inhibitor
Name:
BDBM50000130
Synonyms:
CHEMBL320550
Type:
Small organic molecule
Emp. Form.:
C14H15Cl2NO8
Mol. Mass.:
396.177
SMILES:
OC1C(O)C(NC(=O)COc2ccc(Cl)cc2Cl)OC(C1O)C(O)=O
: