Target
Stromelysin-1
Ligand
BDBM26526
Substrate
Meas. Tech.
ChEMBL_104737 (CHEMBL710737)
Ki
141±n/a nM
Citation
 Duan, JJChen, LWasserman, ZRLu, ZLiu, RQCovington, MBQian, MHardman, KDMagolda, RLNewton, RCChrist, DDWexler, RRDecicco, CP Discovery of gamma-lactam hydroxamic acids as selective inhibitors of tumor necrosis factor alpha converting enzyme: design, synthesis, and structure-activity relationships. J Med Chem 45:4954-7 (2002)  
Target
Name:
Stromelysin-1
Synonyms:
MMP-3 MMP3_HUMAN Matrix metalloproteinase 3 Matrix metalloproteinase-3 (MMP-3) SL-1 Stromelysin 1 | Transin-1
Type:
Enzyme
Mol. Mass.:
53973.13
Organism:
Homo sapiens (Human)
Description:
P08254
Residue:
477
  
Inhibitor
Name:
BDBM26526
Synonyms:
(2R)-N-hydroxy-2-[(3S)-3-methyl-3-{4-[(2-methylquinolin-4-yl)methoxy]phenyl}-2-oxopyrrolidin-1-yl]propanamide CHEMBL148169 | IK682
Type:
Small organic molecule
Emp. Form.:
C25H27N3O4
Mol. Mass.:
433.4996
SMILES:
C[C@@H](N1CC[C@](C)(C1=O)c1ccc(OCc2cc(C)nc3ccccc23)cc1)C(=O)NO
: