Target
5-hydroxytryptamine receptor 2A
Ligand
BDBM50120938
Substrate
Meas. Tech.
ChEMBL_2666 (CHEMBL617914)
Ki
36±n/a nM
Citation
 Liégeois, JFEyrolles, LEllenbroek, BALejeune, CCarato, PBruhwyler, JGéczy, JDamas, JDelarge, J New pyridobenzodiazepine derivatives: modifications of the basic side chain differentially modulate binding to dopamine (D(4.2), D(2L)) and serotonin (5-HT(2A)) receptors. J Med Chem 45:5136-49 (2002)  
Target
Name:
5-hydroxytryptamine receptor 2A
Synonyms:
5-HT-2A 5-HT2A 5-hydroxytryptamine receptor 2A (5HT2A) Htr2 Serotonin Receptor 2A
Type:
G Protein-Coupled Receptor (GPCR)
Mol. Mass.:
52852.05
Organism:
Rattus norvegicus (rat)
Description:
Rat cortex membranes 5-HT2A receptors.
Residue:
471
  
Inhibitor
Name:
BDBM50120938
Synonyms:
(8-Benzyl-8-aza-bicyclo[3.2.1]oct-3-yl)-(8-chloro-11H-benzo[e]pyrido[3,2-b][1,4]diazepin-6-yl)-amine | CHEMBL148353
Type:
Small organic molecule
Emp. Form.:
C26H26ClN5
Mol. Mass.:
443.971
SMILES:
Clc1ccc2Nc3ncccc3N=C(NC3CC4CCC(C3)N4Cc3ccccc3)c2c1
: