Target
Gonadotropin-releasing hormone receptor
Ligand
BDBM50121099
Substrate
Meas. Tech.
ChEBML_71598
Ki
24±n/a nM
Citation
 Luthin, DRHong, YPathak, VPPaderes, GNared-Hood, KDCastro, MAVazir, HLi, HTompkins, EChristie, LMay, JMAnderson, MB The discovery of novel small molecule non-peptide gonadotropin releasing hormone (GnRH) receptor antagonists. Bioorg Med Chem Lett 12:3467-70 (2002)  
Target
Name:
Gonadotropin-releasing hormone receptor
Synonyms:
GNRHR GRHR GnRH-R Gonadotropin-releasing hormone receptor | Gonadotropin-releasing hormone receptor (GnRH)
Type:
Enzyme
Mol. Mass.:
37749.45
Organism:
Homo sapiens (Human)
Description:
P30968
Residue:
328
  
Inhibitor
Name:
BDBM50121099
Synonyms:
4-({[5-(3,5,5,8,8-Pentamethyl-5,6,7,8-tetrahydro-naphthalen-2-ylmethyl)-furan-2-carbonyl]-amino}-methyl)-cyclohexanecarboxylic acid methyl ester | CHEMBL331277
Type:
Small organic molecule
Emp. Form.:
C30H41NO4
Mol. Mass.:
479.6508
SMILES:
COC(=O)[C@H]1CC[C@H](CNC(=O)c2ccc(Cc3cc4c(cc3C)C(C)(C)CCC4(C)C)o2)CC1
: