Target
Gonadotropin-releasing hormone receptor
Ligand
BDBM50121090
Substrate
Meas. Tech.
ChEBML_71598
Ki
16±n/a nM
Citation
 Luthin, DRHong, YPathak, VPPaderes, GNared-Hood, KDCastro, MAVazir, HLi, HTompkins, EChristie, LMay, JMAnderson, MB The discovery of novel small molecule non-peptide gonadotropin releasing hormone (GnRH) receptor antagonists. Bioorg Med Chem Lett 12:3467-70 (2002)  
Target
Name:
Gonadotropin-releasing hormone receptor
Synonyms:
GNRHR GRHR GnRH-R Gonadotropin-releasing hormone receptor | Gonadotropin-releasing hormone receptor (GnRH)
Type:
Enzyme
Mol. Mass.:
37749.45
Organism:
Homo sapiens (Human)
Description:
P30968
Residue:
328
  
Inhibitor
Name:
BDBM50121090
Synonyms:
5-(3,5,5,8,8-Pentamethyl-5,6,7,8-tetrahydro-naphthalen-2-ylmethyl)-furan-2-carboxylic acid (4-guanidinomethyl-cyclohexylmethyl)-amide | CHEMBL115482
Type:
Small organic molecule
Emp. Form.:
C30H44N4O2
Mol. Mass.:
492.696
SMILES:
Cc1cc2c(cc1Cc1ccc(o1)C(=O)NC[C@H]1CC[C@H](CNC(N)=N)CC1)C(C)(C)CCC2(C)C
: