Target
Peptide deformylase, mitochondrial
Ligand
BDBM50121438
Substrate
Meas. Tech.
ChEMBL_154177 (CHEMBL762381)
IC50
>1000±n/a nM
Citation
 Smith, HKBeckett, RPClements, JMDoel, SEast, SPLaunchbury, SBPratt, LMSpavold, ZMThomas, WTodd, RSWhittaker, M Structure-activity relationships of the peptide deformylase inhibitor BB-3497: modification of the metal binding group. Bioorg Med Chem Lett 12:3595-9 (2002)  
Target
Name:
Peptide deformylase, mitochondrial
Synonyms:
DEFM_HUMAN PDF1A Peptide deformylase, mitochondrial | Polypeptide deformylase
Type:
PROTEIN
Mol. Mass.:
27023.25
Organism:
Homo sapiens (Human)
Description:
ChEMBL_154318
Residue:
243
  
Inhibitor
Name:
BDBM50121438
Synonyms:
CHEMBL120291 | [2-((S)-1-Dimethylcarbamoyl-2,2-dimethyl-propylcarbamoyl)-hexyl]-phosphinic acid
Type:
Small organic molecule
Emp. Form.:
C15H31N2O4P
Mol. Mass.:
334.3914
SMILES:
CCCCC(CP(O)=O)C(=O)N[C@H](C(=O)N(C)C)C(C)(C)C
: