Target
Amine oxidase [flavin-containing] A/B
Ligand
BDBM50121457
Substrate
Meas. Tech.
ChEMBL_122448 (CHEMBL731137)
Ki
50±n/a nM
Citation
 Manna, FChimenti, FBolasco, ASecci, DBizzarri, BBefani, OTurini, PMondovi, BAlcaro, STafi, A Inhibition of amine oxidases activity by 1-acetyl-3,5-diphenyl-4,5-dihydro-(1H)-pyrazole derivatives. Bioorg Med Chem Lett 12:3629-33 (2002)  
Target
Name:
Amine oxidase [flavin-containing] A/B
Synonyms:
Monoamine oxidase
Type:
Mol. Mass.:
Description:
ASSAY_ID of ChEMBL is 1929828
Components:
This complex has 2 components.
Component 1
Name:
Amine oxidase [flavin-containing] B
Synonyms:
AOFB_BOVIN MAO-B Monoamine Oxidase Type B (MAO-B) Monoamine oxidase B | Monoamine oxidase type B
Type:
PROTEIN
Mol. Mass.:
58428.94
Organism:
Bos taurus
Description:
ChEMBL_1501478
Residue:
520
  
Component 2
Name:
Amine oxidase [flavin-containing] A
Synonyms:
AOFA_BOVIN MAO-A Monoamine Oxidase Type A (MAO-A) Monoamine oxidase A | Monoamine oxidase type A
Type:
PROTEIN
Mol. Mass.:
59764.63
Organism:
Bos taurus
Description:
ChEMBL_1501477
Residue:
527
  
Inhibitor
Name:
BDBM50121457
Synonyms:
1-[3-(2,4-Dihydroxy-phenyl)-5-m-tolyl-4,5-dihydro-pyrazol-1-yl]-ethanone | CHEMBL121432
Type:
Small organic molecule
Emp. Form.:
C18H18N2O3
Mol. Mass.:
310.3471
SMILES:
CC(=O)N1N=C(CC1c1cccc(C)c1)c1ccc(O)cc1O
: