Target
Gonadotropin-releasing hormone receptor
Ligand
BDBM50121466
Substrate
Meas. Tech.
ChEBML_71600
Ki
80±n/a nM
Citation
 Luthin, DRHong, YTompkins, EAnderes, KLPaderes, GKraynov, EACastro, MANared-Hood, KDCastillo, RGregory, MVazir, HMay, JMAnderson, MB Characterization of mono- and diaminopyrimidine derivatives as novel, nonpeptide gonadotropin releasing hormone (GnRH) receptor antagonists. Bioorg Med Chem Lett 12:3635-9 (2002)  
Target
Name:
Gonadotropin-releasing hormone receptor
Synonyms:
GNRHR GRHR GnRH-R Gonadotropin-releasing hormone receptor | Gonadotropin-releasing hormone receptor (GnRH)
Type:
Enzyme
Mol. Mass.:
37749.45
Organism:
Homo sapiens (Human)
Description:
P30968
Residue:
328
  
Inhibitor
Name:
BDBM50121466
Synonyms:
5-(3,5,5,8,8-Pentamethyl-5,6,7,8-tetrahydro-naphthalen-2-ylmethyl)-furan-2-carboxylic acid 3-[(4-morpholin-4-yl-pyrimidin-2-ylamino)-methyl]-benzylamide | CHEMBL121367
Type:
Small organic molecule
Emp. Form.:
C37H45N5O3
Mol. Mass.:
607.7849
SMILES:
Cc1cc2c(cc1Cc1ccc(o1)C(=O)NCc1cccc(CNc3nccc(n3)N3CCOCC3)c1)C(C)(C)CCC2(C)C
: