Target
Estrogen receptor
Ligand
BDBM50121601
Substrate
Meas. Tech.
ChEMBL_67518 (CHEMBL682301)
Ki
125±n/a nM
Citation
 Henke, BRConsler, TGGo, NHale, RLHohman, DRJones, SALu, ATMoore, LBMoore, JTOrband-Miller, LARobinett, RGShearin, JSpearing, PKStewart, ELTurnbull, PSWeaver, SLWilliams, SPWisely, GBLambert, MH A new series of estrogen receptor modulators that display selectivity for estrogen receptor beta. J Med Chem 45:5492-505 (2002)  
Target
Name:
Estrogen receptor
Synonyms:
ER ESR ESR1_HUMAN Estrogen receptor Estrogen receptor (ER-alpha) Estrogen receptor alpha (ER) Nuclear receptor subfamily 3 group A member 1
Type:
Protein
Mol. Mass.:
66230.44
Organism:
Homo sapiens (Human)
Description:
P03372
Residue:
595
  
Inhibitor
Name:
BDBM50121601
Synonyms:
4-[2-(4-{[3-(2,4-Dichloro-phenyl)-propyl]-methyl-amino}-6-piperazin-1-yl-[1,3,5]triazin-2-ylamino)-ethyl]-phenol | CHEMBL356874
Type:
Small organic molecule
Emp. Form.:
C25H31Cl2N7O
Mol. Mass.:
516.466
SMILES:
CN(CCCc1ccc(Cl)cc1Cl)c1nc(NCCc2ccc(O)cc2)nc(n1)N1CCNCC1
: