Target
Estrogen receptor beta
Ligand
BDBM50121615
Substrate
Meas. Tech.
ChEMBL_67203 (CHEMBL838887)
Ki
270±n/a nM
Citation
 Henke, BRConsler, TGGo, NHale, RLHohman, DRJones, SALu, ATMoore, LBMoore, JTOrband-Miller, LARobinett, RGShearin, JSpearing, PKStewart, ELTurnbull, PSWeaver, SLWilliams, SPWisely, GBLambert, MH A new series of estrogen receptor modulators that display selectivity for estrogen receptor beta. J Med Chem 45:5492-505 (2002)  
Target
Name:
Estrogen receptor beta
Synonyms:
ER-beta ESR2_HUMAN Estradiol receptor beta (ERβ) Estrogen receptor (ER beta) Estrogen receptor beta (ER beta) NR3A2 estrogen beta
Type:
Protein
Mol. Mass.:
59238.43
Organism:
Homo sapiens (Human)
Description:
Q92731
Residue:
530
  
Inhibitor
Name:
BDBM50121615
Synonyms:
2-(4-{4-{[3-(4-Chloro-phenyl)-propyl]-methyl-amino}-6-[2-(4-hydroxy-phenyl)-ethylamino]-[1,3,5]triazin-2-yl}-piperazin-1-yl)-N,N-dimethyl-acetamide | CHEMBL150879
Type:
Small organic molecule
Emp. Form.:
C29H39ClN8O2
Mol. Mass.:
567.125
SMILES:
CN(C)C(=O)CN1CCN(CC1)c1nc(NCCc2ccc(O)cc2)nc(n1)N(C)CCCc1ccc(Cl)cc1
: