Target
Cannabinoid receptor 1
Ligand
BDBM50121665
Substrate
Meas. Tech.
ChEMBL_46136 (CHEMBL660010)
Ki
5000±n/a nM
Citation
 Appendino, GLigresti, AMinassi, ADaddario, NBisogno, TDi Marzo, V Homologues and isomers of noladin ether, a putative novel endocannabinoid: interaction with rat cannabinoid CB(1) receptors. Bioorg Med Chem Lett 13:43-6 (2002)  
Target
Name:
Cannabinoid receptor 1
Synonyms:
Brain-type cannabinoid receptor CB-R CNR1_RAT Cannabinoid receptor Cnr1 | Skr6
Type:
G Protein-Coupled Receptor (GPCR)
Mol. Mass.:
52856.55
Organism:
Rattus norvegicus (rat)
Description:
P20272
Residue:
473
  
Inhibitor
Name:
BDBM50121665
Synonyms:
3-[((8Z,11Z,14Z)-Icosa-5,8,11,14-tetraenyl)oxy]-propane-1,2-diol | CHEMBL140841
Type:
Small organic molecule
Emp. Form.:
C23H40O3
Mol. Mass.:
364.5619
SMILES:
CCCCC\C=C/C\C=C/C\C=C/C\C=C/CCCCOCC(O)CO
: