Target
Gamma-aminobutyric acid receptor subunit alpha-3/beta-2/gamma-2
Ligand
BDBM50078032
Substrate
Meas. Tech.
ChEMBL_68412 (CHEMBL680328)
Ki
33±n/a nM
Citation
 Costanzo, AGuerrini, GCiciani, GBruni, FCostagli, CSelleri, SBesnard, FCosta, BMartini, CMalmberg-Aiello, P Benzodiazepine receptor ligands. 7. Synthesis and pharmacological evaluation of new 3-esters of the 8-chloropyrazolo[5,1-c][1,2,4]benzotriazine 5-oxide. 3-(2-Thienylmethoxycarbonyl) derivative: an anxioselective agent in rodents. J Med Chem 45:5710-20 (2002)  
Target
Name:
Gamma-aminobutyric acid receptor subunit alpha-3/beta-2/gamma-2
Synonyms:
GABA A receptor alpha-3/beta-2/gamma-2 | GABA receptor alpha-3/beta-2/gamma-2 subunit
Type:
Mol. Mass.:
Description:
ASSAY_ID of EBI is 68412
Components:
This complex has 3 components.
Component 1
Name:
Gamma-aminobutyric acid receptor subunit beta-2
Synonyms:
GBRB2_RAT Gabrb2 | Gamma-aminobutyric acid receptor subunit beta-2 (GABA(A) beta-2)
Type:
Enzyme
Mol. Mass.:
54648.97
Organism:
Rattus norvegicus (Rat)
Description:
P63138
Residue:
474
  
Component 2
Name:
Gamma-aminobutyric acid receptor subunit gamma-2
Synonyms:
GBRG2_RAT Gamma-aminobutyric acid receptor subunit gamma-2 (GABA(A) gamma-2)
Type:
Enzyme
Mol. Mass.:
54087.63
Organism:
Rattus norvegicus (Rat)
Description:
P18508
Residue:
466
  
Component 3
Name:
Gamma-aminobutyric acid receptor subunit alpha-3
Synonyms:
GABA A anti-Alpha3 GABA receptor alpha-3 subunit Gabra-3 Gamma-aminobutyric acid receptor subunit alpha-3
Type:
Enzyme Catalytic Domain
Mol. Mass.:
55444.88
Organism:
RAT
Description:
GABA A Alpha3Beta2Gamma2 0 RAT::P20236
Residue:
493
  
Inhibitor
Name:
BDBM50078032
Synonyms:
8-Chloro-3-thiophen-3-yl-benzo[e]pyrazolo[5,1-c][1,2,4]triazine 5-oxide | CHEMBL303152
Type:
Small organic molecule
Emp. Form.:
C13H7ClN4OS
Mol. Mass.:
302.739
SMILES:
[O-][n+]1nc2c(cnn2c2cc(Cl)ccc12)-c1ccsc1
: