Target
Glutamate receptor 1
Ligand
BDBM50122089
Substrate
Meas. Tech.
ChEMBL_72844 (CHEMBL680869)
Ki
250±n/a nM
Citation
 Kromann, HKrikstolaityte, SAndersen, AJAndersen, KKrogsgaard-Larsen, PJaroszewski, JWEgebjerg, JStrømgaard, K Solid-phase synthesis of polyamine toxin analogues: potent and selective antagonists of Ca2+-permeable AMPA receptors. J Med Chem 45:5745-54 (2002)  
Target
Name:
Glutamate receptor 1
Synonyms:
AMPA-selective glutamate receptor 1 GLUR1 GRIA1_HUMAN GluR-A Glutamate AMPA 1 Glutamate receptor AMPA 1/2 Glutamate receptor ionotropic, AMPA 1
Type:
Enzyme Catalytic Domain
Mol. Mass.:
101512.92
Organism:
Homo sapiens (Human)
Description:
Glutamate AMPA 1 GRIA1 HUMAN::P42261
Residue:
906
  
Inhibitor
Name:
BDBM50122089
Synonyms:
CHEMBL352030 | N-[1-[8-(3-Amino-propylamino)-octylcarbamoyl]-2-(4-hydroxy-phenyl)-ethyl]-benzamide
Type:
Small organic molecule
Emp. Form.:
C27H40N4O3
Mol. Mass.:
468.6315
SMILES:
NCCCNCCCCCCCCNC(=O)C(Cc1ccc(O)cc1)NC(=O)c1ccccc1
: