Target
Retinoic acid receptor RXR-alpha
Ligand
BDBM50122351
Substrate
Meas. Tech.
ChEBML_196753
Kd
2±n/a nM
Citation
 Farmer, LJZhi, LJeong, SLamph, WWOsburn, DLCroston, GFlatten, KSHeyman, RANadzan, AM Retinoic acid receptor ligands based on the 6-cyclopropyl-2,4-hexadienoic acid. Bioorg Med Chem Lett 13:261-4 (2002)  
Target
Name:
Retinoic acid receptor RXR-alpha
Synonyms:
NR2B1 Nuclear receptor subfamily 4 group A member 2 RXRA Retinoic acid receptor RXR-alpha/gamma Retinoid receptor
Type:
PROTEIN
Mol. Mass.:
50820.38
Organism:
Homo sapiens (Human)
Description:
ChEMBL_1456363
Residue:
462
  
Inhibitor
Name:
BDBM50122351
Synonyms:
(2E,4E)-3-Methyl-6-[1-(5,5,8,8-tetramethyl-5,6,7,8-tetrahydro-naphthalen-2-yl)-cyclopropyl]-hexa-2,4-dienoic acid | CHEMBL89331
Type:
Small organic molecule
Emp. Form.:
C24H32O2
Mol. Mass.:
352.5097
SMILES:
C\C(\C=C\CC1(CC1)c1ccc2c(c1)C(C)(C)CCC2(C)C)=C/C(O)=O
: