Target
Sodium-dependent serotonin transporter
Ligand
BDBM31023
Substrate
Meas. Tech.
ChEBML_201994
Ki
6±n/a nM
Citation
 van Hes, RSmid, PStroomer, CNTipker, KTulp, MTvan der Heyden, JAMcCreary, ACHesselink, MBKruse, CG SLV310, a novel, potential antipsychotic, combining potent dopamine D2 receptor antagonism with serotonin reuptake inhibition. Bioorg Med Chem Lett 13:405-8 (2003)  
Target
Name:
Sodium-dependent serotonin transporter
Synonyms:
5-HT Transporter 5HT transporter Anandamid membrane transporter, AMT Monoamine transporters; Norepinephrine & serotonin Slc6a4 Sodium-dependent serotonin transporter (SERT) | imipramine receptor
Type:
Multi-pass membrane protein
Mol. Mass.:
70168.43
Organism:
Rattus norvegicus (rat)
Description:
P31652
Residue:
630
  
Inhibitor
Name:
BDBM31023
Synonyms:
3-(1,2,3,6-tetrahydropyridin-4-yl)-1H-indole CHEMBL27811 SMR000029333 | cid_2761023
Type:
Small organic molecule
Emp. Form.:
C13H14N2
Mol. Mass.:
198.2637
SMILES:
C1CC(=CCN1)c1c[nH]c2ccccc12
: