Target
Chorismate synthase
Ligand
BDBM50123086
Substrate
Meas. Tech.
ChEBML_49434
IC50
5200±n/a nM
Citation
 Thomas, MGLawson, CAllanson, NMLeslie, BWBottomley, JRMcBride, AOlusanya, OA A series of 2(Z)-2-benzylidene-6,7-dihydroxybenzofuran-3[2H]-ones as inhibitors of chorismate synthase. Bioorg Med Chem Lett 13:423-6 (2003)  
Target
Name:
Chorismate synthase
Synonyms:
AROC_STRPN | aroC
Type:
PROTEIN
Mol. Mass.:
42869.22
Organism:
Streptococcus pneumoniae
Description:
ChEMBL_49433
Residue:
388
  
Inhibitor
Name:
BDBM50123086
Synonyms:
2-[1-(2-Chloro-phenyl)-meth-(E)-ylidene]-6,7-dihydroxy-benzofuran-3-one | CHEMBL135017
Type:
Small organic molecule
Emp. Form.:
C15H9ClO4
Mol. Mass.:
288.683
SMILES:
Oc1ccc2C(=O)\C(Oc2c1O)=C/c1ccccc1Cl
: