Target
Chorismate synthase
Ligand
BDBM50123099
Substrate
Meas. Tech.
ChEBML_49434
IC50
320±n/a nM
Citation
 Thomas, MGLawson, CAllanson, NMLeslie, BWBottomley, JRMcBride, AOlusanya, OA A series of 2(Z)-2-benzylidene-6,7-dihydroxybenzofuran-3[2H]-ones as inhibitors of chorismate synthase. Bioorg Med Chem Lett 13:423-6 (2003)  
Target
Name:
Chorismate synthase
Synonyms:
AROC_STRPN | aroC
Type:
PROTEIN
Mol. Mass.:
42869.22
Organism:
Streptococcus pneumoniae
Description:
ChEMBL_49433
Residue:
388
  
Inhibitor
Name:
BDBM50123099
Synonyms:
2-[1-(4-Hexyloxy-2-hydroxy-phenyl)-meth-(E)-ylidene]-6,7-dihydroxy-benzofuran-3-one | CHEMBL135231
Type:
Small organic molecule
Emp. Form.:
C21H22O6
Mol. Mass.:
370.3958
SMILES:
CCCCCCOc1ccc(\C=C2\Oc3c(ccc(O)c3O)C2=O)c(O)c1
: