Target
Inosine-5'-monophosphate dehydrogenase 2
Ligand
BDBM50123335
Substrate
Meas. Tech.
ChEMBL_89814 (CHEMBL698781)
IC50
<5±n/a nM
Citation
 Watterson, SHCarlsen, MDhar, TGShen, ZPitts, WJGuo, JGu, HHNorris, DChorba, JChen, PCheney, DWitmer, MFleener, CARouleau, KTownsend, RHollenbaugh, DLIwanowicz, EJ Novel inhibitors of IMPDH: a highly potent and selective quinolone-based series. Bioorg Med Chem Lett 13:543-6 (2003)  
Target
Name:
Inosine-5'-monophosphate dehydrogenase 2
Synonyms:
IMDH2_HUMAN IMPD 2 IMPDH-II Inosine 5'-monophosphate dehydrogenase II (IMPDH II) Inosine-5 -monophosphate dehydrogenase 2 | Inosine-5'-monophosphate dehydrogenase (IMPDH)
Type:
Enzyme
Mol. Mass.:
55806.87
Organism:
Homo sapiens (Human)
Description:
Recombinant IMPDH2 expressed in E. coli.
Residue:
514
  
Inhibitor
Name:
BDBM50123335
Synonyms:
2-(3,4-Dimethyl-phenyl)-7-methoxy-6-oxazol-5-yl-1H-quinolin-4-one | CHEMBL358876
Type:
Small organic molecule
Emp. Form.:
C21H18N2O3
Mol. Mass.:
346.3792
SMILES:
COc1cc2nc(cc(O)c2cc1-c1cnco1)-c1ccc(C)c(C)c1
: