Target
Inosine-5'-monophosphate dehydrogenase 2
Ligand
BDBM50123348
Substrate
Meas. Tech.
ChEBML_89930
IC50
12±n/a nM
Citation
 Dhar, TGWatterson, SHChen, PShen, ZGu, HHNorris, DCarlsen, MHaslow, KDPitts, WJGuo, JChorba, JFleener, CARouleau, KATownsend, RHollenbaugh, DIwanowicz, EJ Quinolone-based IMPDH inhibitors: introduction of basic residues on ring D and SAR of the corresponding mono, di and benzofused analogues. Bioorg Med Chem Lett 13:547-51 (2003)  
Target
Name:
Inosine-5'-monophosphate dehydrogenase 2
Synonyms:
IMDH2_HUMAN IMPD 2 IMPDH-II Inosine 5'-monophosphate dehydrogenase II (IMPDH II) Inosine-5 -monophosphate dehydrogenase 2 | Inosine-5'-monophosphate dehydrogenase (IMPDH)
Type:
Enzyme
Mol. Mass.:
55806.87
Organism:
Homo sapiens (Human)
Description:
Recombinant IMPDH2 expressed in E. coli.
Residue:
514
  
Inhibitor
Name:
BDBM50123348
Synonyms:
2-Methoxy-N-[6-(7-methoxy-6-oxazol-5-yl-4-oxo-1,4-dihydro-quinolin-2-yl)-indan-1-yl]-N-methyl-acetamide | CHEMBL155617
Type:
Small organic molecule
Emp. Form.:
C26H25N3O5
Mol. Mass.:
459.4938
SMILES:
COCC(=O)N(C)C1CCc2ccc(cc12)-c1cc(O)c2cc(-c3cnco3)c(OC)cc2n1
: