Target
Cannabinoid receptor 1
Ligand
BDBM50123692
Substrate
Meas. Tech.
ChEMBL_46640 (CHEMBL658896)
Ki
9±n/a nM
Citation
 Katoch-Rouse, RPavlova, OACaulder, THoffman, AFMukhin, AGHorti, AG Synthesis, structure-activity relationship, and evaluation of SR141716 analogues: development of central cannabinoid receptor ligands with lower lipophilicity. J Med Chem 46:642-5 (2003)  
Target
Name:
Cannabinoid receptor 1
Synonyms:
Brain-type cannabinoid receptor CB-R CNR1_RAT Cannabinoid receptor Cnr1 | Skr6
Type:
G Protein-Coupled Receptor (GPCR)
Mol. Mass.:
52856.55
Organism:
Rattus norvegicus (rat)
Description:
P20272
Residue:
473
  
Inhibitor
Name:
BDBM50123692
Synonyms:
5-(4-Chloro-phenyl)-1-(2,4-dichloro-phenyl)-1H-pyrazole-3-carboxylic acid piperidin-1-ylamide CHEMBL160963
Type:
Small organic molecule
Emp. Form.:
C21H19Cl3N4O
Mol. Mass.:
449.761
SMILES:
Clc1ccc(cc1)-c1cc(nn1-c1ccc(Cl)cc1Cl)C(=O)NN1CCCCC1
: