Target
Serine protease 1
Ligand
BDBM50123770
Substrate
Meas. Tech.
ChEMBL_213251 (CHEMBL821459)
Ki
>2900±n/a nM
Citation
 Choi-Sledeski, YMKearney, RPoli, GPauls, HGardner, CGong, YBecker, MDavis, RSpada, ALiang, GChu, VBrown, KCollussi, DLeadley, RRebello, SMoxey, PMorgan, SBentley, RKasiewski, CMaignan, SGuilloteau, JPMikol, V Discovery of an orally efficacious inhibitor of coagulation factor Xa which incorporates a neutral P1 ligand. J Med Chem 46:681-4 (2003)  
Target
Name:
Serine protease 1
Synonyms:
Alpha-trypsin chain 1 Beta-trypsin PRSS1 TRP1 TRY1_HUMAN Thrombin & trypsin Trypsin I | Trypsin-1
Type:
Enzyme
Mol. Mass.:
26557.80
Organism:
Homo sapiens (Human)
Description:
P07477
Residue:
247
  
Inhibitor
Name:
BDBM50123770
Synonyms:
4-(6-Chloro-benzo[b]thiophene-2-sulfonyl)-1-(1H-pyrrolo[2,3-c]pyridin-2-ylmethyl)-piperazin-2-one | CHEMBL353793
Type:
Small organic molecule
Emp. Form.:
C20H17ClN4O3S2
Mol. Mass.:
460.957
SMILES:
Clc1ccc2cc(sc2c1)S(=O)(=O)N1CCN(Cc2cc3cc[nH]cc3n2)C(=O)C1
: