Target
Growth factor receptor-bound protein 2
Ligand
BDBM50124298
Substrate
Meas. Tech.
ChEBML_72365
IC50
13±n/a nM
Citation
 Li, PPeach, MLZhang, MLiu, HYang, DNicklaus, MRoller, PP Structure-based design of thioether-bridged cyclic phosphopeptides binding to Grb2-SH2 domain. Bioorg Med Chem Lett 13:895-9 (2003)  
Target
Name:
Growth factor receptor-bound protein 2
Synonyms:
ASH GRB2 adapter protein Grb2-SH2 | Growth factor receptor-bound protein 2
Type:
Protein
Mol. Mass.:
25205.04
Organism:
Homo sapiens (Human)
Description:
P62993
Residue:
217
  
Inhibitor
Name:
BDBM50124298
Synonyms:
2-[9-(4-phosphonooxybenzyl)-21-carbamoyl-24-(4-hydroxybenzyl)-12-isobutyl-33-isopropyl-15,27-dimethyl-8,11,14,17,23,26,29,32,35,38-decaoxo-19-thia-7,10,13,16,22,25,28,31,34,37-decaazaspiro[5.32]octatriacont-36-yl]acetamide | CHEMBL2371623
Type:
Small organic molecule
Emp. Form.:
C53H77N12O17PS
Mol. Mass.:
1217.287
SMILES:
CC(C)C[C@@H]1NC(=O)[C@H](C)NC(=O)CSC[C@H](NC(=O)[C@H](Cc2ccc(O)cc2)NC(=O)[C@H](C)NC(=O)CNC(=O)[C@@H](NC(=O)[C@H](CC(N)=O)NC(=O)C2(CCCCC2)NC(=O)[C@H](Cc2ccc(OP(O)(O)=O)cc2)NC1=O)C(C)C)C(N)=O
: