Target
Peroxisome proliferator-activated receptor delta
Ligand
BDBM50124370
Substrate
Meas. Tech.
ChEBML_154031
Ki
47±n/a nM
Citation
 Adams, ADYuen, WHu, ZSantini, CJones, ABMacNaul, KLBerger, JPDoebber, TWMoller, DE Amphipathic 3-phenyl-7-propylbenzisoxazoles; human pPaR gamma, delta and alpha agonists. Bioorg Med Chem Lett 13:931-5 (2003)  
Target
Name:
Peroxisome proliferator-activated receptor delta
Synonyms:
NR1C2 NUCI Nuclear receptor subfamily 1 group C member 2 PPAR-beta PPARD Peroxisome proliferator-activated receptor Peroxisome proliferator-activated receptor delta
Type:
Enzyme
Mol. Mass.:
49910.45
Organism:
Homo sapiens (Human)
Description:
Q03181
Residue:
441
  
Inhibitor
Name:
BDBM50124370
Synonyms:
CHEMBL173409 | {3-[4-(3-Phenyl-7-propyl-benzo[d]isoxazol-6-yloxy)-butoxy]-phenoxy}-acetic acid
Type:
Small organic molecule
Emp. Form.:
C28H29NO6
Mol. Mass.:
475.533
SMILES:
CCCc1c(OCCCCOc2cccc(OCC(O)=O)c2)ccc2c(noc12)-c1ccccc1
: