Target
Peroxisome proliferator-activated receptor delta
Ligand
BDBM50124379
Substrate
Meas. Tech.
ChEMBL_154031 (CHEMBL759301)
Ki
5±n/a nM
Citation
 Adams, ADYuen, WHu, ZSantini, CJones, ABMacNaul, KLBerger, JPDoebber, TWMoller, DE Amphipathic 3-phenyl-7-propylbenzisoxazoles; human pPaR gamma, delta and alpha agonists. Bioorg Med Chem Lett 13:931-5 (2003)  
Target
Name:
Peroxisome proliferator-activated receptor delta
Synonyms:
NR1C2 NUCI Nuclear receptor subfamily 1 group C member 2 PPAR-beta PPARD Peroxisome proliferator-activated receptor Peroxisome proliferator-activated receptor delta
Type:
Enzyme
Mol. Mass.:
49910.45
Organism:
Homo sapiens (Human)
Description:
Q03181
Residue:
441
  
Inhibitor
Name:
BDBM50124379
Synonyms:
2-(4-(3-(3-phenyl-7-propylbenzo[d]isoxazol-6-yloxy)propoxy)phenyl)acetic acid {4-[3-(3-Phenyl-7-propyl-benzo[d]isoxazol-6-yloxy)-propoxy]-phenyl}-acetic acid
Type:
Small organic molecule
Emp. Form.:
C27H27NO5
Mol. Mass.:
445.507
SMILES:
CCCc1c(OCCCOc2ccc(CC(O)=O)cc2)ccc2c(noc12)-c1ccccc1
: