Target
Peroxisome proliferator-activated receptor alpha
Ligand
BDBM50124376
Substrate
Meas. Tech.
ChEMBL_153242 (CHEMBL764654)
EC50
3±n/a nM
Citation
 Adams, ADYuen, WHu, ZSantini, CJones, ABMacNaul, KLBerger, JPDoebber, TWMoller, DE Amphipathic 3-phenyl-7-propylbenzisoxazoles; human pPaR gamma, delta and alpha agonists. Bioorg Med Chem Lett 13:931-5 (2003)  
Target
Name:
Peroxisome proliferator-activated receptor alpha
Synonyms:
NR1C1 PPAR PPAR-alpha PPARA_HUMAN Peroxisome proliferator-activated receptor | Peroxisome proliferator-activated receptor alpha (PPAR alpha)
Type:
Enzyme
Mol. Mass.:
52222.08
Organism:
Homo sapiens (Human)
Description:
Q07869
Residue:
468
  
Inhibitor
Name:
BDBM50124376
Synonyms:
4-{4-[3-(3-Phenyl-7-propyl-benzo[d]isoxazol-6-yloxy)-propoxy]-phenyl}-butyric acid | CHEMBL175332
Type:
Small organic molecule
Emp. Form.:
C29H31NO5
Mol. Mass.:
473.5601
SMILES:
CCCc1c(OCCCOc2ccc(CCCC(O)=O)cc2)ccc2c(noc12)-c1ccccc1
: