Target
Peroxisome proliferator-activated receptor alpha
Ligand
BDBM50124389
Substrate
Meas. Tech.
ChEBML_153549
Ki
13±n/a nM
Citation
 Adams, ADYuen, WHu, ZSantini, CJones, ABMacNaul, KLBerger, JPDoebber, TWMoller, DE Amphipathic 3-phenyl-7-propylbenzisoxazoles; human pPaR gamma, delta and alpha agonists. Bioorg Med Chem Lett 13:931-5 (2003)  
Target
Name:
Peroxisome proliferator-activated receptor alpha
Synonyms:
NR1C1 PPAR PPAR-alpha PPARA_HUMAN Peroxisome proliferator-activated receptor | Peroxisome proliferator-activated receptor alpha (PPAR alpha)
Type:
Enzyme
Mol. Mass.:
52222.08
Organism:
Homo sapiens (Human)
Description:
Q07869
Residue:
468
  
Inhibitor
Name:
BDBM50124389
Synonyms:
2,2-Dimethyl-3-{4-[4-(3-phenyl-7-propyl-benzo[d]isoxazol-6-yloxy)-butoxy]-phenyl}-propionic acid | CHEMBL173159
Type:
Small organic molecule
Emp. Form.:
C31H35NO5
Mol. Mass.:
501.6133
SMILES:
CCCc1c(OCCCCOc2ccc(CC(C)(C)C(O)=O)cc2)ccc2c(noc12)-c1ccccc1
: