Target
Peroxisome proliferator-activated receptor gamma
Ligand
BDBM50124391
Substrate
Meas. Tech.
ChEBML_154053
Ki
348±n/a nM
Citation
 Adams, ADYuen, WHu, ZSantini, CJones, ABMacNaul, KLBerger, JPDoebber, TWMoller, DE Amphipathic 3-phenyl-7-propylbenzisoxazoles; human pPaR gamma, delta and alpha agonists. Bioorg Med Chem Lett 13:931-5 (2003)  
Target
Name:
Peroxisome proliferator-activated receptor gamma
Synonyms:
NR1C3 PPAR-gamma PPARG_HUMAN Peroxisome proliferator-activated receptor gamma (PPAR gamma) Peroxisome proliferator-activated receptor gamma (PPARĪ³) peroxisome proliferator-activated receptor gamma isoform 2
Type:
Nuclear Receptor
Mol. Mass.:
57613.46
Organism:
Homo sapiens (Human)
Description:
P37231
Residue:
505
  
Inhibitor
Name:
BDBM50124391
Synonyms:
CHEMBL176421 | {2-[4-(3-Phenyl-7-propyl-benzo[d]isoxazol-6-yloxy)-butoxy]-phenyl}-acetic acid
Type:
Small organic molecule
Emp. Form.:
C28H29NO5
Mol. Mass.:
459.5336
SMILES:
CCCc1c(OCCCCOc2ccccc2CC(O)=O)ccc2c(noc12)-c1ccccc1
: