Target
Peroxisome proliferator-activated receptor delta
Ligand
BDBM50124378
Substrate
Meas. Tech.
ChEMBL_154031 (CHEMBL759301)
Ki
4.6±n/a nM
Citation
 Adams, ADYuen, WHu, ZSantini, CJones, ABMacNaul, KLBerger, JPDoebber, TWMoller, DE Amphipathic 3-phenyl-7-propylbenzisoxazoles; human pPaR gamma, delta and alpha agonists. Bioorg Med Chem Lett 13:931-5 (2003)  
Target
Name:
Peroxisome proliferator-activated receptor delta
Synonyms:
NR1C2 NUCI Nuclear receptor subfamily 1 group C member 2 PPAR-beta PPARD Peroxisome proliferator-activated receptor Peroxisome proliferator-activated receptor delta
Type:
Enzyme
Mol. Mass.:
49910.45
Organism:
Homo sapiens (Human)
Description:
Q03181
Residue:
441
  
Inhibitor
Name:
BDBM50124378
Synonyms:
2-{4-[3-(3-Phenyl-7-propyl-benzo[d]isoxazol-6-yloxy)-propoxy]-phenoxy}-propionic acid | CHEMBL172490
Type:
Small organic molecule
Emp. Form.:
C28H29NO6
Mol. Mass.:
475.533
SMILES:
CCCc1c(OCCCOc2ccc(OC(C)C(O)=O)cc2)ccc2c(noc12)-c1ccccc1
: