Target
Amine oxidase [flavin-containing] B
Ligand
BDBM15583
Substrate
Meas. Tech.
ChEMBL_122782 (CHEMBL730890)
Ki
150000±n/a nM
Citation
 Silvestri, RLa Regina, GDe Martino, GArtico, MBefani, OPalumbo, MAgostinelli, ETurini, P Simple, potent, and selective pyrrole inhibitors of monoamine oxidase types A and B. J Med Chem 46:917-20 (2003)  
Target
Name:
Amine oxidase [flavin-containing] B
Synonyms:
AOFB_BOVIN MAO-B Monoamine Oxidase Type B (MAO-B) Monoamine oxidase B | Monoamine oxidase type B
Type:
PROTEIN
Mol. Mass.:
58428.94
Organism:
Bos taurus
Description:
ChEMBL_1501478
Residue:
520
  
Inhibitor
Name:
BDBM15583
Synonyms:
CHEMBL174040 pyrrole inhibitor 9
Type:
Small organic molecule
Emp. Form.:
C12H12N2O
Mol. Mass.:
200.2365
SMILES:
O=C(NCc1ccccc1)c1ccc[nH]1
: