Target
Melanocortin receptor 4
Ligand
BDBM50451763
Substrate
Meas. Tech.
ChEMBL_106182 (CHEMBL714601)
EC50
8±n/a nM
Citation
 Danho, WSwistok, JCheung, AWKurylko, GFranco, LChu, XJChen, LYagaloff, K Structure-activity relationship of linear peptide Bu-His6-DPhe7-Arg8-Trp9-Gly10-NH2 at the human melanocortin-1 and -4 receptors: DPhe7 and Trp9 substitution. Bioorg Med Chem Lett 13:649-52 (2003)  
Target
Name:
Melanocortin receptor 4
Synonyms:
MC4-R MC4R_HUMAN Melanocortin receptor 4 (MC-4) Melanocortin receptor 4 (MC4R)
Type:
Enzyme
Mol. Mass.:
36949.50
Organism:
Homo sapiens (Human)
Description:
P32245
Residue:
332
  
Inhibitor
Name:
BDBM50451763
Synonyms:
CHEMBL2112919
Type:
Small organic molecule
Emp. Form.:
C36H48N12O6S
Mol. Mass.:
776.908
SMILES:
CCCC(=O)N[C@@H](Cc1c[nH]cn1)C(=O)N[C@H](Cc1cccs1)C(=O)N[C@@H](CCCN=C(N)N)C(=O)N[C@@H](Cc1c[nH]c2ccccc12)C(=O)NCC(N)=O
: