Target
Methionine--tRNA ligase
Ligand
BDBM50124799
Substrate
Meas. Tech.
ChEBML_105151
IC50
15±n/a nM
Citation
 Jarvest, RLBerge, JMBrown, MJBrown, PElder, JSForrest, AKHouge-Frydrych, CSO'Hanlon, PJMcNair, DJRittenhouse, SSheppard, RJ Optimisation of aryl substitution leading to potent methionyl tRNA synthetase inhibitors with excellent gram-positive antibacterial activity. Bioorg Med Chem Lett 13:665-8 (2003)  
Target
Name:
Methionine--tRNA ligase
Synonyms:
Methionyl-tRNA synthetase metG
Type:
PROTEIN
Mol. Mass.:
76245.79
Organism:
Escherichia coli (strain K12)
Description:
ChEMBL_400681
Residue:
677
  
Inhibitor
Name:
BDBM50124799
Synonyms:
2-[3-(2,4-Dichloro-benzylamino)-propylamino]-1H-quinolin-4-one | CHEMBL161400
Type:
Small organic molecule
Emp. Form.:
C19H19Cl2N3O
Mol. Mass.:
376.28
SMILES:
Oc1cc(NCCCNCc2ccc(Cl)cc2Cl)nc2ccccc12
: