Target
Methionine--tRNA ligase
Ligand
BDBM50124835
Substrate
Meas. Tech.
ChEMBL_105150 (CHEMBL716780)
IC50
4.3±n/a nM
Citation
 Jarvest, RLBerge, JMBrown, MJBrown, PElder, JSForrest, AKHouge-Frydrych, CSO'Hanlon, PJMcNair, DJRittenhouse, SSheppard, RJ Optimisation of aryl substitution leading to potent methionyl tRNA synthetase inhibitors with excellent gram-positive antibacterial activity. Bioorg Med Chem Lett 13:665-8 (2003)  
Target
Name:
Methionine--tRNA ligase
Synonyms:
Methionyl-tRNA synthetase metG
Type:
PROTEIN
Mol. Mass.:
76245.79
Organism:
Escherichia coli (strain K12)
Description:
ChEMBL_400681
Residue:
677
  
Inhibitor
Name:
BDBM50124835
Synonyms:
2-[3-(6-Bromo-8-ethyl-1,2,3,4-tetrahydro-quinolin-4-ylamino)-propylamino]-1H-quinolin-4-one | CHEMBL162356
Type:
Small organic molecule
Emp. Form.:
C23H27BrN4O
Mol. Mass.:
455.391
SMILES:
CCc1cc(Br)cc2C(CCNc12)NCCCNc1cc(O)c2ccccc2n1
: