Target
Methionine--tRNA ligase
Ligand
BDBM50112575
Substrate
Meas. Tech.
ChEMBL_105150 (CHEMBL716780)
IC50
8±n/a nM
Citation
 Jarvest, RLBerge, JMBrown, MJBrown, PElder, JSForrest, AKHouge-Frydrych, CSO'Hanlon, PJMcNair, DJRittenhouse, SSheppard, RJ Optimisation of aryl substitution leading to potent methionyl tRNA synthetase inhibitors with excellent gram-positive antibacterial activity. Bioorg Med Chem Lett 13:665-8 (2003)  
Target
Name:
Methionine--tRNA ligase
Synonyms:
Methionyl-tRNA synthetase metG
Type:
PROTEIN
Mol. Mass.:
76245.79
Organism:
Escherichia coli (strain K12)
Description:
ChEMBL_400681
Residue:
677
  
Inhibitor
Name:
BDBM50112575
Synonyms:
2-[3-(6,8-Dibromo-1,2,3,4-tetrahydro-quinolin-4-ylamino)-propylamino]-1H-quinolin-4-one | CHEMBL304237
Type:
Small organic molecule
Emp. Form.:
C21H22Br2N4O
Mol. Mass.:
506.234
SMILES:
Oc1cc(NCCCNC2CCNc3c(Br)cc(Br)cc23)nc2ccccc12
: