Target
Prothrombin
Ligand
BDBM50124994
Substrate
Meas. Tech.
ChEBML_208863
IC50
809±n/a nM
Citation
 Huang, WNaughton, MAYang, HSu, TDam, SWong, PWArfsten, AEdwards, SSinha, UHollenbach, SScarborough, RMZhu, BY Design, synthesis, and structure-activity relationships of unsubstituted piperazinone-based transition state factor Xa inhibitors. Bioorg Med Chem Lett 13:723-8 (2003)  
Target
Name:
Prothrombin
Synonyms:
Activation peptide fragment 1 Coagulation factor II Prothrombin precursor Thrombin heavy chain | Thrombin light chain
Type:
Protein
Mol. Mass.:
70029.57
Organism:
Homo sapiens (Human)
Description:
P00734
Residue:
622
  
Inhibitor
Name:
BDBM50124994
Synonyms:
2-[4-(4-Bromo-benzenesulfonyl)-2-oxo-piperazin-1-yl]-N-[4-guanidino-1-(thiazole-2-carbonyl)-butyl]-acetamide | CHEMBL164426
Type:
Small organic molecule
Emp. Form.:
C21H26BrN7O5S2
Mol. Mass.:
600.509
SMILES:
NC(=N)NCCCC(NC(=O)CN1CCN(CC1=O)S(=O)(=O)c1ccc(Br)cc1)C(=O)c1nccs1
: