Target
Coagulation factor X
Ligand
BDBM50079240
Substrate
Meas. Tech.
ChEMBL_69674 (CHEMBL682012)
Ki
0.110000±n/a nM
Citation
 Quan, MLEllis, CDHe, MYLiauw, AYLam, PYRossi, KAKnabb, RMLuettgen, JMWright, MRWong, PCWexler, RR Nonbenzamidine isoxazoline derivatives as factor Xa inhibitors. Bioorg Med Chem Lett 13:1023-8 (2003)  
Target
Name:
Coagulation factor X
Synonyms:
F10 | FA10_RABIT
Type:
PROTEIN
Mol. Mass.:
53951.21
Organism:
Oryctolagus cuniculus
Description:
ChEMBL_1471174
Residue:
490
  
Inhibitor
Name:
BDBM50079240
Synonyms:
3-(3-Carbamimidoyl-phenyl)-5-tetrazol-1-ylmethyl-4,5-dihydro-isoxazole-5-carboxylic acid [5-(2-sulfamoyl-phenyl)-pyridin-2-yl]-amide; TFA CHEMBL93210
Type:
Small organic molecule
Emp. Form.:
C24H22N10O4S
Mol. Mass.:
546.561
SMILES:
NC(=N)c1cccc(c1)C1=NOC(Cn2cnnn2)(C1)C(=O)Nc1ccc(cn1)-c1ccccc1S(N)(=O)=O
: