Target
5-hydroxytryptamine receptor 7
Ligand
BDBM50222782
Substrate
Meas. Tech.
ChEMBL_3709 (CHEMBL618161)
Ki
9.1±n/a nM
Citation
 Forbes, ITCooper, DGDodds, EKDouglas, SEGribble, ADIfe, RJLightfoot, APMeeson, MCampbell, LPColeman, TRiley, GJThomas, DR Identification of a novel series of selective 5-HT7 receptor antagonists. Bioorg Med Chem Lett 13:1055-8 (2003)  
Target
Name:
5-hydroxytryptamine receptor 7
Synonyms:
5-HT-7 5-HT7 5-HT7S 5HT7 HTR7 | Serotonin receptor 7
Type:
G Protein-Coupled Receptor (GPCR)
Mol. Mass.:
53573.08
Organism:
Homo sapiens (Human)
Description:
P34969
Residue:
479
  
Inhibitor
Name:
BDBM50222782
Synonyms:
CHEMBL9770
Type:
Small organic molecule
Emp. Form.:
C24H30N2O2
Mol. Mass.:
378.5072
SMILES:
Cc1ccc(OC2CCN(CCN3CCCc4ccccc4C3=O)CC2)cc1
: