Target
Peptidyl-prolyl cis-trans isomerase A
Ligand
BDBM50125711
Substrate
Meas. Tech.
ChEMBL_51874 (CHEMBL666529)
IC50
8500±n/a nM
Citation
 Wu, YQBelyakov, SChoi, CLimburg, DThomas IV, BEVaal, MWei, LWilkinson, DEHolmes, AFuller, MMcCormick, JConnolly, MMoeller, TSteiner, JHamilton, GS Synthesis and biological evaluation of non-peptidic cyclophilin ligands. J Med Chem 46:1112-5 (2003)  
Target
Name:
Peptidyl-prolyl cis-trans isomerase A
Synonyms:
Cyclophilin A Ppia
Type:
PROTEIN
Mol. Mass.:
17878.16
Organism:
Rattus norvegicus
Description:
ChEMBL_51874
Residue:
164
  
Inhibitor
Name:
BDBM50125711
Synonyms:
1-(2,4-Dimethyl-phenyl)-3-{3-[3-(2,4-dimethyl-phenyl)-ureido]-phenyl}-urea | CHEMBL13640
Type:
Small organic molecule
Emp. Form.:
C24H26N4O2
Mol. Mass.:
402.4888
SMILES:
Cc1ccc(NC(=O)Nc2cccc(NC(=O)Nc3ccc(C)cc3C)c2)c(C)c1
: