Target
Melanocyte-stimulating hormone receptor
Ligand
BDBM50125748
Substrate
Meas. Tech.
ChEMBL_105834 (CHEMBL716493)
IC50
5.1±n/a nM
Citation
 Herpin, TFYu, GCarlson, KEMorton, GCWu, XKang, LTuerdi, HKhanna, ATokarski, JSLawrence, RMMacor, JE Discovery of tyrosine-based potent and selective melanocortin-1 receptor small-molecule agonists with anti-inflammatory properties. J Med Chem 46:1123-6 (2003)  
Target
Name:
Melanocyte-stimulating hormone receptor
Synonyms:
MC1-R MSH-R MSHR_HUMAN Melanocortin receptor (M1 and M4) Melanocortin receptor 1 (MC1-R) | Melanocortin receptor 1 (MC1R)
Type:
Enzyme
Mol. Mass.:
34717.23
Organism:
Homo sapiens (Human)
Description:
Q01726
Residue:
317
  
Inhibitor
Name:
BDBM50125748
Synonyms:
2-Acetylamino-N-[2-(4-butyryl-4-phenyl-piperidin-1-yl)-1-(4-methoxy-benzyl)-2-oxo-ethyl]-3-(1H-imidazol-4-yl)-propionamide | CHEMBL275067
Type:
Small organic molecule
Emp. Form.:
C33H41N5O5
Mol. Mass.:
587.7091
SMILES:
CCCC(=O)C1(CCN(CC1)C(=O)[C@@H](Cc1ccc(OC)cc1)NC(=O)[C@@H](Cc1cnc[nH]1)NC(C)=O)c1ccccc1
: