Target
Polymerase acidic protein
Ligand
BDBM50125801
Substrate
Meas. Tech.
ChEMBL_157581 (CHEMBL763331)
IC50
430.0±n/a nM
Citation
 Parkes, KEErmert, PFässler, JIves, JMartin, JAMerrett, JHObrecht, DWilliams, GKlumpp, K Use of a pharmacophore model to discover a new class of influenza endonuclease inhibitors. J Med Chem 46:1153-64 (2003)  
Target
Name:
Polymerase acidic protein
Synonyms:
Hepatitis C virus polyprotein PA/PB1 Polymerase acidic protein | RNA-directed RNA polymerase subunit P2
Type:
PROTEIN
Mol. Mass.:
82573.84
Organism:
Hepatitis C virus
Description:
ChEMBL_64976
Residue:
716
  
Inhibitor
Name:
BDBM50125801
Synonyms:
4-[1-Benzyl-4-(4-chloro-benzyl)-piperidin-4-yl]-2-hydroxy-4-oxo-but-2-enoic acid CHEMBL463590
Type:
Small organic molecule
Emp. Form.:
C23H24ClNO4
Mol. Mass.:
413.894
SMILES:
OC(=O)C(=O)CC(=O)C1(Cc2ccc(Cl)cc2)CCN(Cc2ccccc2)CC1
: