Target
Polymerase acidic protein
Ligand
BDBM50409791
Substrate
Meas. Tech.
ChEMBL_64976 (CHEMBL675561)
IC50
38000±n/a nM
Citation
 Parkes, KEErmert, PFässler, JIves, JMartin, JAMerrett, JHObrecht, DWilliams, GKlumpp, K Use of a pharmacophore model to discover a new class of influenza endonuclease inhibitors. J Med Chem 46:1153-64 (2003)  
Target
Name:
Polymerase acidic protein
Synonyms:
Hepatitis C virus polyprotein PA/PB1 Polymerase acidic protein | RNA-directed RNA polymerase subunit P2
Type:
PROTEIN
Mol. Mass.:
82573.84
Organism:
Hepatitis C virus
Description:
ChEMBL_64976
Residue:
716
  
Inhibitor
Name:
BDBM50409791
Synonyms:
CHEMBL276589
Type:
Small organic molecule
Emp. Form.:
C18H16ClN3O4
Mol. Mass.:
373.79
SMILES:
CCC(=O)c1c(O)n(O)c2cc(NC(=O)Nc3ccc(Cl)cc3)ccc12
: