Target
Polymerase acidic protein
Ligand
BDBM50409802
Substrate
Meas. Tech.
ChEMBL_220754 (CHEMBL841914)
IC50
26000±n/a nM
Citation
 Parkes, KEErmert, PFässler, JIves, JMartin, JAMerrett, JHObrecht, DWilliams, GKlumpp, K Use of a pharmacophore model to discover a new class of influenza endonuclease inhibitors. J Med Chem 46:1153-64 (2003)  
Target
Name:
Polymerase acidic protein
Synonyms:
PA RNA-directed RNA polymerase subunit P2
Type:
PROTEIN
Mol. Mass.:
83123.24
Organism:
Influenza B virus (B/Lee/40)
Description:
ChEMBL_220754
Residue:
726
  
Inhibitor
Name:
BDBM50409802
Synonyms:
CHEMBL277536
Type:
Small organic molecule
Emp. Form.:
C24H17ClN2O4
Mol. Mass.:
432.856
SMILES:
Oc1c(C(=O)c2ccccc2)c2ccc(NC(=O)\C=C\c3ccccc3Cl)cc2n1O
: