Target
Protein farnesyltransferase subunit beta/geranylgeranyltransferase type-1 subunit alpha
Ligand
BDBM50126027
Substrate
Meas. Tech.
ChEMBL_141347 (CHEMBL750319)
EC50
<1±n/a nM
Citation
 Lin, NHWang, LCohen, JGu, WZFrost, DZhang, HRosenberg, SSham, H Synthesis and biological evaluation of 4-[3-biphenyl-2-yl-1-hydroxy-1-(3-methyl-3H-imidazol-4-yl)-prop-2-ynyl]-1-yl-benzonitrile as novel farnesyltransferase inhibitor. Bioorg Med Chem Lett 13:1293-6 (2003)  
Target
Name:
Protein farnesyltransferase subunit beta/geranylgeranyltransferase type-1 subunit alpha
Synonyms:
Farnesyltransferase (FTase) Protein Farnesyltransferase (PFT) Chain B | Protein farnesyltransferase
Type:
Protein Complex
Mol. Mass.:
Description:
To express recombinant enzyme in E. coli, the cloned human alpha and beta subunits were co-expressed from a plasmid, in which their expression was translationally coupled.
Components:
This complex has 2 components.
Component 1
Name:
Protein farnesyltransferase subunit beta
Synonyms:
CAAX farnesyltransferase subunit alpha FNTB FTase-alpha GGTase-I-alpha Protein farnesyl/geranylgeranyl transferase Protein farnesyltransferase subunit beta Protein farnesyltransferase/geranylgeranyltransferase type-1 subunit alpha Ras proteins prenyltransferase subunit beta | Type I protein geranyl-geranyltransferase subunit alpha
Type:
Enzyme Subunit
Mol. Mass.:
48766.02
Organism:
Homo sapiens (Human)
Description:
Protein farnesyltransferase subunit beta
Residue:
437
  
Component 2
Name:
Protein farnesyltransferase/geranylgeranyltransferase type-1 subunit alpha
Synonyms:
CAAX farnesyltransferase alpha subunit FNTA_HUMAN FTase-alpha Geranylgeranyl Transferase (GGTase-I) Chain A Protein Farnesyltransferase (PFT) Chain A Protein farnesyltransferase Protein farnesyltransferase/geranylgeranyltransferase type I alpha subunit | Ras proteins prenyltransferase alpha
Type:
Enzyme
Mol. Mass.:
44392.46
Organism:
Homo sapiens (Human)
Description:
Recombinant human FTase.
Residue:
379
  
Inhibitor
Name:
BDBM50126027
Synonyms:
4-[3-(4-Ethynyl-phenyl)-1-hydroxy-1-(3-methyl-3H-imidazol-4-yl)-prop-2-ynyl]-2-naphthalen-1-yl-benzonitrile | CHEMBL24554
Type:
Small organic molecule
Emp. Form.:
C32H21N3O
Mol. Mass.:
463.5286
SMILES:
Cn1cncc1C(O)(C#Cc1ccc(cc1)C#C)c1ccc(C#N)c(c1)-c1cccc2ccccc12
: