Target
Geranylgeranyl transferase type-1 subunit beta
Ligand
BDBM50126032
Substrate
Meas. Tech.
ChEBML_71792
IC50
210±n/a nM
Citation
 Lin, NHWang, LCohen, JGu, WZFrost, DZhang, HRosenberg, SSham, H Synthesis and biological evaluation of 4-[3-biphenyl-2-yl-1-hydroxy-1-(3-methyl-3H-imidazol-4-yl)-prop-2-ynyl]-1-yl-benzonitrile as novel farnesyltransferase inhibitor. Bioorg Med Chem Lett 13:1293-6 (2003)  
Target
Name:
Geranylgeranyl transferase type-1 subunit beta
Synonyms:
2.5.1.59 Geranylgeranyl transferase type I Geranylgeranyl transferase type I subunit beta PGGT1B Protein farnesyl/geranylgeranyl transferase | Type I protein geranyl-geranyltransferase subunit beta
Type:
Mol. Mass.:
42369.84
Organism:
Homo sapiens (Human)
Description:
Residue:
377
  
Inhibitor
Name:
BDBM50126032
Synonyms:
5-[3-(4-Cyano-phenyl)-1-hydroxy-1-(3-methyl-3H-imidazol-4-yl)-prop-2-ynyl]-2'-methyl-biphenyl-2-carbonitrile | CHEMBL282349
Type:
Small organic molecule
Emp. Form.:
C28H20N4O
Mol. Mass.:
428.4846
SMILES:
Cc1ccccc1-c1cc(ccc1C#N)C(O)(C#Cc1ccc(cc1)C#N)c1cncn1C
: