Target
Melanocortin receptor 4
Ligand
BDBM50126085
Substrate
Meas. Tech.
ChEMBL_106337 (CHEMBL872791)
IC50
675±n/a nM
Citation
 Cheung, AWDanho, WSwistok, JQi, LKurylko, GRowan, KYeon, MFranco, LChu, XJChen, LYagaloff, K Structure-activity relationship of cyclic peptide penta-c[Asp-His(6)-DPhe(7)-Arg(8)-Trp(9)-Lys]-NH(2) at the human melanocortin-1 and -4 receptors: His(6) substitution. Bioorg Med Chem Lett 13:1307-11 (2003)  
Target
Name:
Melanocortin receptor 4
Synonyms:
MC4-R MC4R_HUMAN Melanocortin receptor 4 (MC-4) Melanocortin receptor 4 (MC4R)
Type:
Enzyme
Mol. Mass.:
36949.50
Organism:
Homo sapiens (Human)
Description:
P32245
Residue:
332
  
Inhibitor
Name:
BDBM50126085
Synonyms:
CHEMBL384036 | MT-II cyclic peptide derivative
Type:
Small organic molecule
Emp. Form.:
C52H66ClN11O9
Mol. Mass.:
1024.602
SMILES:
CCCCC(=O)N[C@@H]1CC(=O)NCCCC[C@H](NC(=O)[C@H](Cc2c[nH]c3ccccc23)NC(=O)[C@@H](CCCNC(N)=O)NC(=O)[C@H](Cc2ccccc2)NC(=O)C2(CCc3c(Cl)cccc3C2)NC1=O)C(N)=O
: