Target
Microsomal triglyceride transfer protein large subunit
Ligand
BDBM50126225
Substrate
Meas. Tech.
ChEBML_123010
IC50
25±n/a nM
Citation
 Magnin, DRBiller, SAWetterau, JRobl, JADickson, JKTaunk, PHarrity, TWLawrence, RMSun, CQWang, TLogan, JFryszman, OConnolly, FJolibois, KKunselman, L Microsomal triglyceride transfer protein inhibitors: discovery and synthesis of alkyl phosphonates as potent MTP inhibitors and cholesterol lowering agents. Bioorg Med Chem Lett 13:1337-40 (2003)  
Target
Name:
Microsomal triglyceride transfer protein large subunit
Synonyms:
MTP MTTP
Type:
PROTEIN
Mol. Mass.:
99049.43
Organism:
Bos taurus
Description:
ChEMBL_123010
Residue:
887
  
Inhibitor
Name:
BDBM50126225
Synonyms:
CHEMBL26665 | {4-[9-(2,2,2-Trifluoro-ethylcarbamoyl)-9H-fluoren-9-yl]-butyl}-phosphonic acid bis-(3-pyridin-2-yl-propyl) ester
Type:
Small organic molecule
Emp. Form.:
C36H39F3N3O4P
Mol. Mass.:
665.6815
SMILES:
FC(F)(F)CNC(=O)C1(CCCCP(=O)(OCCCc2ccccn2)OCCCc2ccccn2)c2ccccc2-c2ccccc12
: