Target
Geranylgeranyl transferase type-1 subunit beta/Protein farnesyltransferase/geranylgeranyltransferase type-1 subunit alpha
Ligand
BDBM50126340
Substrate
Meas. Tech.
ChEMBL_71681 (CHEMBL681673)
IC50
230±n/a nM
Citation
 Curtin, MLFlorjancic, ASCohen, JGu, WZFrost, DJMuchmore, SWSham, HL Novel and selective imidazole-containing biphenyl inhibitors of protein farnesyltransferase. Bioorg Med Chem Lett 13:1367-71 (2003)  
Target
Name:
Geranylgeranyl transferase type-1 subunit beta/Protein farnesyltransferase/geranylgeranyltransferase type-1 subunit alpha
Synonyms:
Geranylgeranyl Transferase (GGTase-I) Geranylgeranyl transferase type I
Type:
Protein Complex
Mol. Mass.:
Description:
Components:
This complex has 2 components.
Component 1
Name:
Protein farnesyltransferase/geranylgeranyltransferase type-1 subunit alpha
Synonyms:
CAAX farnesyltransferase alpha subunit FNTA_BOVIN GGTase-I-alpha Protein Farnesyltransferase (PFT) Chain A Protein farnesyltransferase/geranylgeranyltransferase type I alpha subunit Type I protein geranyl-geranyltransferase alpha subunit
Type:
Enzyme
Mol. Mass.:
43827.38
Organism:
Bos taurus (bovine)
Description:
The enzyme was purified from a bovine brain homogenate by sequential ammonium sulfate fractionation and affinity chromatography.
Residue:
375
  
Component 2
Name:
Geranylgeranyl transferase type-1 subunit beta
Synonyms:
GGTase-I-beta Geranylgeranyl transferase type-1 subunit beta PGTB1_BOVIN | Type I protein geranyl-geranyltransferase subunit beta
Type:
Enzyme
Mol. Mass.:
42483.88
Organism:
Bos taurus (bovine)
Description:
Purified from bovine brain
Residue:
377
  
Inhibitor
Name:
BDBM50126340
Synonyms:
4-[(3-Cyano-benzyl)-(3-methyl-3H-imidazol-4-ylmethyl)-amino]-2-naphthalen-1-yl-benzonitrile | CHEMBL431884
Type:
Small organic molecule
Emp. Form.:
C29H23ClN4
Mol. Mass.:
462.973
SMILES:
Cn1cncc1CN(Cc1cccc(Cl)c1)c1ccc(C#N)c(c1)-c1cccc2ccccc12
: