Target
Protein farnesyltransferase subunit beta/geranylgeranyltransferase type-1 subunit alpha
Ligand
BDBM50126334
Substrate
Meas. Tech.
ChEMBL_69849 (CHEMBL680439)
IC50
10±n/a nM
Citation
 Curtin, MLFlorjancic, ASCohen, JGu, WZFrost, DJMuchmore, SWSham, HL Novel and selective imidazole-containing biphenyl inhibitors of protein farnesyltransferase. Bioorg Med Chem Lett 13:1367-71 (2003)  
Target
Name:
Protein farnesyltransferase subunit beta/geranylgeranyltransferase type-1 subunit alpha
Synonyms:
Protein Farnesyltransferase (PFT) | Protein farnesyltransferase
Type:
Protein Complex
Mol. Mass.:
Description:
Purified bovine brain FTase.
Components:
This complex has 2 components.
Component 1
Name:
Protein farnesyltransferase/geranylgeranyltransferase type-1 subunit alpha
Synonyms:
CAAX farnesyltransferase alpha subunit FNTA_BOVIN GGTase-I-alpha Protein Farnesyltransferase (PFT) Chain A Protein farnesyltransferase/geranylgeranyltransferase type I alpha subunit Type I protein geranyl-geranyltransferase alpha subunit
Type:
Enzyme
Mol. Mass.:
43827.38
Organism:
Bos taurus (bovine)
Description:
The enzyme was purified from a bovine brain homogenate by sequential ammonium sulfate fractionation and affinity chromatography.
Residue:
375
  
Component 2
Name:
Protein farnesyltransferase subunit beta
Synonyms:
CAAX farnesyltransferase subunit beta FNTB_BOVIN Protein farnesyltransferase Protein farnesyltransferase subunit beta Ras proteins prenyltransferase subunit beta
Type:
Enzyme Subunit
Mol. Mass.:
48758.49
Organism:
Bos taurus (bovine)
Description:
Protein farnesyltransferase subunit beta
Residue:
437
  
Inhibitor
Name:
BDBM50126334
Synonyms:
5-[(4-Cyano-benzyl)-(3-methyl-3H-imidazol-4-ylmethyl)-amino]-2'-methyl-biphenyl-2-carbonitrile | CHEMBL284448
Type:
Small organic molecule
Emp. Form.:
C27H23N5
Mol. Mass.:
417.505
SMILES:
Cc1ccccc1-c1cc(ccc1C#N)N(Cc1cncn1C)Cc1ccc(cc1)C#N
: