Target
cGMP-specific 3',5'-cyclic phosphodiesterase
Ligand
BDBM50126459
Substrate
Meas. Tech.
ChEBML_155207
IC50
20±n/a nM
Citation
 Maw, GNAllerton, CMGbekor, EMillion, WA Design, synthesis and biological activity of beta-carboline-based type-5 phosphodiesterase inhibitors. Bioorg Med Chem Lett 13:1425-8 (2003)  
Target
Name:
cGMP-specific 3',5'-cyclic phosphodiesterase
Synonyms:
3',5'-cyclic phosphodiesterase PDE5 PDE5A_HUMAN Phosphodiesterase 5 (PDE5) Phosphodiesterase 5A (PDE5A) cGMP-specific 3',5'-cyclic phosphodiesterase
Type:
Protein
Mol. Mass.:
99975.83
Organism:
Homo sapiens (Human)
Description:
O76074
Residue:
875
  
Inhibitor
Name:
BDBM50126459
Synonyms:
(6R,12aR)-6-Benzo[1,3]dioxol-5-yl-2-[(R)-1-(3-dimethylamino-2-oxo-propyl)-pyrrolidin-3-yl]-2,3,6,7,12,12a-hexahydro-pyrazino[1',2':1,6]pyrido[3,4-b]indole-1,4-dione | CHEMBL284627
Type:
Small organic molecule
Emp. Form.:
C30H33N5O5
Mol. Mass.:
543.6135
SMILES:
CN(C)CC(=O)CN1CC[C@H](C1)N1CC(=O)N2[C@H](Cc3c([nH]c4ccccc34)[C@H]2c2ccc3OCOc3c2)C1=O
: