Target
Dual 3',5'-cyclic-AMP and -GMP phosphodiesterase 11A
Ligand
BDBM50126447
Substrate
Meas. Tech.
ChEBML_156293
IC50
85±n/a nM
Citation
 Maw, GNAllerton, CMGbekor, EMillion, WA Design, synthesis and biological activity of beta-carboline-based type-5 phosphodiesterase inhibitors. Bioorg Med Chem Lett 13:1425-8 (2003)  
Target
Name:
Dual 3',5'-cyclic-AMP and -GMP phosphodiesterase 11A
Synonyms:
Dual 3',5'-cyclic-AMP and -GMP phosphodiesterase 11A PDE11_HUMAN Phosphodiesterase 11A Phosphodiesterase 11A4 | cAMP and cGMP phosphodiesterase 11A
Type:
Enzyme
Mol. Mass.:
104751.53
Organism:
Homo sapiens (Human)
Description:
Q9HCR9
Residue:
933
  
Inhibitor
Name:
BDBM50126447
Synonyms:
(6R,12aR)-6-Benzo[1,3]dioxol-5-yl-2-((S)-1-benzyl-pyrrolidin-3-yl)-2,3,6,7,12,12a-hexahydro-pyrazino[1',2':1,6]pyrido[3,4-b]indole-1,4-dione | CHEMBL284059
Type:
Small organic molecule
Emp. Form.:
C32H30N4O4
Mol. Mass.:
534.605
SMILES:
O=C1CN([C@H]2CCN(Cc3ccccc3)C2)C(=O)[C@H]2Cc3c([nH]c4ccccc34)[C@H](N12)c1ccc2OCOc2c1
: